{"text_format":"1","workbook":"xlsx","n_sheets":15,"sheets":["COVER","Basic Instructions","GETTING STARTED","Footnotes list","Table 1 (Level 1 + 2)","Table 2 (Conversion matrix)","Lists","MacroBehaviour","ErrorLog","Locks","MustNotBeNegative","IsNumeric","Summations","xMandatory","Table 3 (Level 3)"],"not_rendered":{"charts":0,"images":3,"macros":1,"external_links":0,"defined_names":3,"comments":0,"pivot_tables":0},"unopened":[],"bounds":{"document_bytes":16777216,"sheet_cells":100000,"rows_first":2000,"rows_last":500,"rows_between":2000,"halvings":0,"cell_chars":16384,"cell_head_chars":4096},"cells_cut":0,"cells_raw":0,"read":"whole","date_system":"1900"}

{"sheet":"COVER","index":0,"n_rows":9,"n_cols":3,"rows_kept":9,"cut":false,"hidden":false,"merged":[]}
[]
[]
[null,null,{"$f":"UPPER(Lists!K3)","v":"STATISTICAL OFFICE OF THE EUROPEAN UNION"}]
[]
[null,null,{"$f":"Lists!K4","v":"Directorate E: Sectoral and regional statistics"}]
[null,null,{"$f":"Lists!K5","v":"Unit E-2: Environmental statistics and accounts; sustainable development"}]
[null,null,{"$f":"UPPER(Lists!K7)","v":"ECOSYSTEM EXTENT ACCOUNTS"}]
[null,null,{"$f":"CONCATENATE(Lists!K8,\" DATA COLLECTION\")","v":"2023 DATA COLLECTION"}]
[null,null,{"$f":"CONCATENATE(\"Launching date: \",Lists!K9)","v":"Launching date: 19 December 2023"}]

{"sheet":"Basic Instructions","index":1,"n_rows":92,"n_cols":6,"rows_kept":92,"cut":false,"hidden":false,"merged":[[91,2,91,5],[66,2,66,5],[68,2,68,5],[70,2,70,5],[72,2,72,5],[74,2,74,5],[78,2,78,5],[80,2,80,5],[85,2,85,5],[87,2,87,5],[88,2,88,5],[90,2,90,5],[64,2,64,5],[44,2,44,5],[45,2,45,5],[46,2,46,5],[47,2,47,5],[49,2,49,5],[50,2,50,5],[51,2,51,5],[54,2,54,5],[55,3,55,5],[61,2,61,5],[62,2,62,5],[43,2,43,5],[18,2,18,5],[19,2,19,5],[20,2,20,5],[21,2,21,5],[22,2,22,5],[24,2,24,5],[28,2,28,5],[29,2,29,5],[30,2,30,5],[34,2,34,5],[40,2,40,5],[17,2,17,5],[3,2,3,5],[4,2,4,5],[6,2,6,5],[8,2,8,5],[9,2,9,5],[10,2,10,5],[11,2,11,5],[12,2,12,5],[13,2,13,5],[14,2,14,5],[15,2,15,5]]}
[]
[]
[null,null,null,null,null,{"$f":"UPPER(Lists!K3)","v":"STATISTICAL OFFICE OF THE EUROPEAN UNION"}]
[null,null,{"$f":"UPPER(Lists!K7)","v":"ECOSYSTEM EXTENT ACCOUNTS"}]
[null,null,{"$f":"CONCATENATE(Lists!K8,\" DATA COLLECTION\")","v":"2023 DATA COLLECTION"}]
[]
[null,null,"BASIC INSTRUCTIONS"]
[]
[null,null,"Before filling in the questionnaire please read carefully the instructions below. "]
[null,null,"This EXCEL workbook is the questionnaire. "]
{"$rows_left_out":83}
{"sheet":"GETTING STARTED","index":2,"n_rows":23,"n_cols":7,"rows_kept":23,"cut":false,"hidden":false,"merged":[[14,3,14,6],[3,2,3,6],[4,2,4,6],[6,2,6,6],[8,2,8,3],[12,2,12,6],[16,3,16,6],[18,3,18,6],[20,3,20,6],[22,3,22,6],[23,2,23,6]]}
[]
[]
[null,null,null,null,null,null,{"$f":"UPPER(Lists!K3)","v":"STATISTICAL OFFICE OF THE EUROPEAN UNION"}]
[null,null,{"$f":"UPPER(Lists!K7)","v":"ECOSYSTEM EXTENT ACCOUNTS"}]
[null,null,{"$f":"CONCATENATE(Lists!K8,\" DATA COLLECTION\")","v":"2023 DATA COLLECTION"}]
[]
[null,null," GETTING STARTED"]
[]
[null,null,"Please select your country (click on the white cell):        ",null,null,null,{"$f":"IF(E9=\"\",\"\",VLOOKUP(E9,Lists!A2:B40,2,FALSE))","v":""}]
[null,null,"Reference year:    "]
{"$rows_left_out":14}
{"sheet":"Footnotes list","index":3,"n_rows":58,"n_cols":5,"rows_kept":58,"cut":false,"hidden":false,"merged":[[1,3,1,4],[3,3,3,4],[4,3,4,4],[6,3,6,4],[7,3,7,4]]}
[]
[]
[null,null,null,null,{"$f":"UPPER(Lists!K3)","v":"STATISTICAL OFFICE OF THE EUROPEAN UNION"}]
[null,null,null,{"$f":"UPPER(Lists!K7)","v":"ECOSYSTEM EXTENT ACCOUNTS"}]
[null,null,null,{"$f":"CONCATENATE(Lists!K8,\" DATA COLLECTION\")","v":"2023 DATA COLLECTION"}]
[]
[null,null,null,"EXPLANATORY FOOTNOTES"]
[null,null,null,{"$f":"IF('GETTING STARTED'!E9=\"\",\"\",'GETTING STARTED'!E9)","v":""}]
[null,null,null,1,"insert explanatory text here"]
[null,null,null,2]
{"$rows_left_out":49}
{"sheet":"Table 1 (Level 1 + 2)","index":4,"n_rows":79,"n_cols":26,"rows_kept":79,"cut":false,"hidden":false,"merged":[[1,5,1,25],[6,24,6,25],[6,8,6,9],[6,12,6,13],[6,16,6,17],[6,20,6,21]]}
[]
[null,null,"previous_time\n(PROPERTY) =>>",{"$f":"IF('GETTING STARTED'!E11=\"\",\"\",'GETTING STARTED'!E11)","v":""},null,"Table 1 - Ecosystem extent accounts\n(a) Area in 1000 ha"]
[null,null,"GEO =>",{"$f":"'GETTING STARTED'!G9","v":""},null,{"$f":"IF('GETTING STARTED'!E9=\"\",\"\",'GETTING STARTED'!E9)","v":""}]
[null,null,"TIME=>",{"$f":"IF('GETTING STARTED'!E10=\"\",\"\",'GETTING STARTED'!E10)","v":""},null,{"$f":" \"Reference year: \" &D4","v":"Reference year: "}]
[null,null,"UNIT=>","THS_HA",null,{"$f":" \"(Previous reference year: \" & 'GETTING STARTED'!$E$11 & \")\"","v":"(Previous reference year: )"}]
[null,null,"ECOSYST_C =>","NAP"]
[null,null,"ECOSYST",null,null,"EU ecosystem typology","Opening area (Extent in the previous reference year)","Standard footnotes","Explanatory\nfootnote",null,"Additions","Standard footnotes","Explanatory\nfootnote",null,"Reductions","Standard footnotes","Explanatory\nfootnote",null,"Closing area (Extent in the current reference year)","Standard footnotes","Explanatory\nfootnote",null,"Net changes (additions less reductions; +/-)","Standard footnotes","Explanatory\nfootnote"]
[null,null,"ECO0101",null,null,"1.1  Continuous settlement area",null,null,null,{"$f":"IF(TRIM(I8)=\"\", \"\", IF(VLOOKUP(I8,'Footnotes list'!$D$9:$E$107,2,FALSE)=0,\"\",VLOOKUP(I8,'Footnotes list'!$D$9:$E$107,2,FALSE) ) )","v":""},null,null,null,{"$f":"IF(TRIM(M8)=\"\", \"\", IF(VLOOKUP(M8,'Footnotes list'!$D$9:$E$107,2,FALSE)=0,\"\",VLOOKUP(M8,'Footnotes list'!$D$9:$E$107,2,FALSE) ) )","v":""},null,null,null,{"$f":"IF(TRIM(Q8)=\"\", \"\", IF(VLOOKUP(Q8,'Footnotes list'!$D$9:$E$107,2,FALSE)=0,\"\",VLOOKUP(Q8,'Footnotes list'!$D$9:$E$107,2,FALSE) ) )","v":""},null,null,null,{"$f":"IF(TRIM(U8)=\"\", \"\", IF(VLOOKUP(U8,'Footnotes list'!$D$9:$E$107,2,FALSE)=0,\"\",VLOOKUP(U8,'Footnotes list'!$D$9:$E$107,2,FALSE) ) )","v":""},{"$f":"IF(TRIM(CONCATENATE(K8,O8))=\"\",\"\",K8-O8)","v":""},null,null,{"$f":"IF(TRIM(Y8)=\"\", \"\", IF(VLOOKUP(Y8,'Footnotes list'!$D$9:$E$107,2,FALSE)=0,\"\",VLOOKUP(Y8,'Footnotes list'!$D$9:$E$107,2,FALSE) ) )","v":""}]
[null,null,"ECO0102",null,null,"1.2  Discontinuous settlement area",null,null,null,{"$f":"IF(TRIM(I9)=\"\", \"\", IF(VLOOKUP(I9,'Footnotes list'!$D$9:$E$107,2,FALSE)=0,\"\",VLOOKUP(I9,'Footnotes list'!$D$9:$E$107,2,FALSE) ) )","v":""},null,null,null,{"$f":"IF(TRIM(M9)=\"\", \"\", IF(VLOOKUP(M9,'Footnotes list'!$D$9:$E$107,2,FALSE)=0,\"\",VLOOKUP(M9,'Footnotes list'!$D$9:$E$107,2,FALSE) ) )","v":""},null,null,null,{"$f":"IF(TRIM(Q9)=\"\", \"\", IF(VLOOKUP(Q9,'Footnotes list'!$D$9:$E$107,2,FALSE)=0,\"\",VLOOKUP(Q9,'Footnotes list'!$D$9:$E$107,2,FALSE) ) )","v":""},null,null,null,{"$f":"IF(TRIM(U9)=\"\", \"\", IF(VLOOKUP(U9,'Footnotes list'!$D$9:$E$107,2,FALSE)=0,\"\",VLOOKUP(U9,'Footnotes list'!$D$9:$E$107,2,FALSE) ) )","v":""},{"$f":"IF(TRIM(CONCATENATE(K9,O9))=\"\",\"\",K9-O9)","v":""},null,null,{"$f":"IF(TRIM(Y9)=\"\", \"\", IF(VLOOKUP(Y9,'Footnotes list'!$D$9:$E$107,2,FALSE)=0,\"\",VLOOKUP(Y9,'Footnotes list'!$D$9:$E$107,2,FALSE) ) )","v":""}]
[null,null,"ECO0103",null,null,"1.3  Infrastructure ",null,null,null,{"$f":"IF(TRIM(I10)=\"\", \"\", IF(VLOOKUP(I10,'Footnotes list'!$D$9:$E$107,2,FALSE)=0,\"\",VLOOKUP(I10,'Footnotes list'!$D$9:$E$107,2,FALSE) ) )","v":""},null,null,null,{"$f":"IF(TRIM(M10)=\"\", \"\", IF(VLOOKUP(M10,'Footnotes list'!$D$9:$E$107,2,FALSE)=0,\"\",VLOOKUP(M10,'Footnotes list'!$D$9:$E$107,2,FALSE) ) )","v":""},null,null,null,{"$f":"IF(TRIM(Q10)=\"\", \"\", IF(VLOOKUP(Q10,'Footnotes list'!$D$9:$E$107,2,FALSE)=0,\"\",VLOOKUP(Q10,'Footnotes list'!$D$9:$E$107,2,FALSE) ) )","v":""},null,null,null,{"$f":"IF(TRIM(U10)=\"\", \"\", IF(VLOOKUP(U10,'Footnotes list'!$D$9:$E$107,2,FALSE)=0,\"\",VLOOKUP(U10,'Footnotes list'!$D$9:$E$107,2,FALSE) ) )","v":""},"",null,null,{"$f":"IF(TRIM(Y10)=\"\", \"\", IF(VLOOKUP(Y10,'Footnotes list'!$D$9:$E$107,2,FALSE)=0,\"\",VLOOKUP(Y10,'Footnotes list'!$D$9:$E$107,2,FALSE) ) )","v":""}]
{"$rows_left_out":70}
{"sheet":"Table 2 (Conversion matrix)","index":5,"n_rows":31,"n_cols":19,"rows_kept":31,"cut":false,"hidden":false,"merged":[[1,4,1,18],[8,18,9,18],[6,6,6,18],[8,15,9,15],[8,16,9,16],[8,17,9,17],[8,12,9,12],[8,13,9,13],[8,14,9,14],[8,6,9,6],[8,7,9,7],[8,8,9,8],[8,9,9,9],[28,4,28,5],[30,4,30,5],[29,4,29,5],[8,10,9,10],[8,11,9,11],[9,4,9,5]]}
[]
[null,null,"previous_time\n(PROPERTY) =>>",{"$f":"IF('GETTING STARTED'!E11=\"\",\"\",'GETTING STARTED'!E11)","v":""},"Table 2 - Conversion matrix\n(a) Area in ha"]
[null,null,"GEO =>",{"$f":"'GETTING STARTED'!G9","v":""},{"$f":"IF('GETTING STARTED'!E9=\"\",\"\",'GETTING STARTED'!E9)","v":""}]
[null,null,"TIME=>",{"$f":"IF('GETTING STARTED'!E10=\"\",\"\",'GETTING STARTED'!E10)","v":""},{"$f":" \"Reference year: \" &D4","v":"Reference year: "}]
[null,null,"UNIT=>","HA",{"$f":" \"(Previous reference year: \" & 'GETTING STARTED'!$E$11 & \")\"","v":"(Previous reference year: )"}]
[null,null,"STK_FLOW=>","STK_CHG"]
[null,null,null,null,null,null,"… TO ECOSYSTEM"]
[null,null,null,null,null,null,1,2,3,4,5,6,7,8,9,10,11,12]
[null,null,"ECOSYST",null,null,null,"Settlements and other artificial areas","Cropland","Grassland ","Forest and woodland","Heathland and shrub","Sparsely vegetated ecosystems","Inland wetlands","Rivers and canals","Lakes and reservoirs","Marine inlets and transitional waters","Coastal beaches, dunes and wetlands","Marine ecosystems ","TOTAL\nREDUCTIONS"]
[null,null,null,null,"FROM ECOSYSTEM…"]
{"$rows_left_out":22}
{"sheet":"Lists","index":6,"n_rows":42,"n_cols":11,"rows_kept":42,"cut":false,"hidden":true,"merged":[[1,9,1,10],[5,9,5,10],[10,9,10,10],[15,9,15,10]]}
["Country label","Country code","Currency","Valid flags (obs_status)","Label",null,"Valid flags (obs_conf)","Label",null,"Textual variables","String"]
["Belgium","BE","EUR","B","break in time series",null,"C","confidential",null,"Institutional names"]
["Bulgaria","BG","BGN","E","estimated data",null,"D","secondary confidentiality set by the sender",null,"Eurostat Text","Statistical Office of the European Union"]
["Czechia","CZ","CZK","P","provisional",null,null,null,null,"Directorate Text","Directorate E: Sectoral and regional statistics"]
["Denmark","DK","DKK","BE",null,null,null,null,null,"Unit Text","Unit E-2: Environmental statistics and accounts; sustainable development"]
["Germany","DE","EUR","BP",null,null,null,null,null,"Data collection information"]
["Estonia","EE","EUR","EP",null,null,null,null,null,"Data Collection Title","Ecosystem Extent Accounts"]
["Ireland","IE","EUR","BEP",null,null,null,null,null,"Data Collection Year",2023]
["Greece","EL","EUR",null,null,null,null,null,null,"Launching date","19 December 2023"]
["Spain","ES","EUR",null,null,null,null,null,null,"Submission deadline","30 April 2024"]
{"$rows_left_out":33}
{"sheet":"MacroBehaviour","index":7,"n_rows":3,"n_cols":7,"rows_kept":3,"cut":false,"hidden":true,"merged":[[0,0,0,2],[0,4,0,6]]}
["COMMON TO ALL (OR MOST)  QUESTIONNAIRE",null,null,null,"SPECIFIC TO THIS QUESTIONNAIRE"]
["Parameter","Value","(Valid values)",null,"Parameter","Value","(Valid values)"]
["DevelopementMode",false,"TRUE (during development)\nFALSE (For real reporting and testing)"]

{"sheet":"ErrorLog","index":8,"n_rows":1,"n_cols":7,"rows_kept":1,"cut":false,"hidden":false,"merged":[]}
["Link to Error","Validation Rule","Cell","Sheet","Description","Severity","Former Color"]

{"sheet":"Locks","index":9,"n_rows":14,"n_cols":7,"rows_kept":14,"cut":false,"hidden":true,"merged":[]}
["Sheet Name","Top Left Cell","Bottom Right Cell","Row Step","Column Step","Lock Type","Focus Back To"]
["Table 1 (Level 1 + 2)","G13","S13",999,4,"Formulas","G8"]
["Table 1 (Level 1 + 2)","G20","S20",999,4,"Formulas","G8"]
["Table 1 (Level 1 + 2)","G23","S23",999,4,"Formulas","G8"]
["Table 1 (Level 1 + 2)","G30","S30",999,4,"Formulas","G8"]
["Table 1 (Level 1 + 2)","G34","S34",999,4,"Formulas","G8"]
["Table 1 (Level 1 + 2)","G38","S38",999,4,"Formulas","G8"]
["Table 1 (Level 1 + 2)","G41","S41",999,4,"Formulas","G8"]
["Table 1 (Level 1 + 2)","G44","S44",999,4,"Formulas","G8"]
["Table 1 (Level 1 + 2)","G48","S48",999,4,"Formulas","G8"]
{"$rows_left_out":5}
{"sheet":"MustNotBeNegative","index":10,"n_rows":25,"n_cols":6,"rows_kept":25,"cut":false,"hidden":true,"merged":[]}
["Severity","SheetName","TopLeftCell","BottomRightCell","RowStep","ColumnStep"]
["Error","Table 1 (Level 1 + 2)","G8","S69",1,4]
["Error","Table 2 (Conversion matrix)","H11","S11",999,1]
["Error","Table 2 (Conversion matrix)","I12","S12",999,1]
["Error","Table 2 (Conversion matrix)","J13","S13",999,1]
["Error","Table 2 (Conversion matrix)","K14","S14",999,1]
["Error","Table 2 (Conversion matrix)","L15","S15",999,1]
["Error","Table 2 (Conversion matrix)","M16","S16",999,1]
["Error","Table 2 (Conversion matrix)","N17","S17",999,1]
["Error","Table 2 (Conversion matrix)","O18","S18",999,1]
{"$rows_left_out":16}
{"sheet":"IsNumeric","index":11,"n_rows":25,"n_cols":6,"rows_kept":25,"cut":false,"hidden":true,"merged":[]}
["Severity","SheetName","TopLeftCell","BottomRightCell","RowStep","ColumnStep"]
["Error","Table 1 (Level 1 + 2)","G8","W69",1,4]
["Error","Table 2 (Conversion matrix)","H11","S11",999,1]
["Error","Table 2 (Conversion matrix)","I12","S12",999,1]
["Error","Table 2 (Conversion matrix)","J13","S13",999,1]
["Error","Table 2 (Conversion matrix)","K14","S14",999,1]
["Error","Table 2 (Conversion matrix)","L15","S15",999,1]
["Error","Table 2 (Conversion matrix)","M16","S16",999,1]
["Error","Table 2 (Conversion matrix)","N17","S17",999,1]
["Error","Table 2 (Conversion matrix)","O18","S18",999,1]
{"$rows_left_out":16}
{"sheet":"Summations","index":12,"n_rows":44,"n_cols":13,"rows_kept":44,"cut":false,"hidden":true,"merged":[[24,5,24,6]]}
["Severity","Sheet Name","List of Cells\n (first block)","First Total Cell (first block)","Last Total Cell\n(Last block)","Row Block Repetition Step","Column Block Repetition Step","Greater or Equal","Valid Tolerance","Only if all data is available","Non compliance Is Valid If Footnote Exists","Footnote Shift From Value","Display text in error"]
["Error","Table 1 (Level 1 + 2)","G8,G9,G10,G11,G12","G13","W13",999,4,"EQ",0.1,"YES","NO",3,"Total ecosystems at level 1 must be equal to the sum of the subcomponents at level 2"]
["Error","Table 1 (Level 1 + 2)","G14,G15,G16,G17,G18,G19","G20","W20",999,4,"EQ",0.1,"YES","NO",3,"Total ecosystems at level 1 must be equal to the sum of the subcomponents at level 2"]
["Error","Table 1 (Level 1 + 2)","G21,G22","G23","W23",999,4,"EQ",0.1,"YES","NO",3,"Total ecosystems at level 1 must be equal to the sum of the subcomponents at level 3"]
["Error","Table 1 (Level 1 + 2)","G24,G25,G26,G27,G28,G29","G30","W30",999,4,"EQ",0.1,"YES","NO",3,"Total ecosystems at level 1 must be equal to the sum of the subcomponents at level 4"]
["Error","Table 1 (Level 1 + 2)","G31,G32,G33","G34","W38",4,4,"EQ",0.1,"YES","NO",3,"Total ecosystems at level 1 must be equal to the sum of the subcomponents at level 5"]
["Error","Table 1 (Level 1 + 2)","G39,G40","G41","W44",3,4,"EQ",0.1,"YES","NO",3,"Total ecosystems at level 1 must be equal to the sum of the subcomponents at level 6"]
["Error","Table 1 (Level 1 + 2)","G45,G46,G47","G48","W52",4,4,"EQ",0.1,"YES","NO",3,"Total ecosystems at level 1 must be equal to the sum of the subcomponents at level 7"]
["Error","Table 1 (Level 1 + 2)","G53,G54,G55,G56","G57","W57",999,4,"EQ",0.1,"YES","NO",3,"Total ecosystems at level 1 must be equal to the sum of the subcomponents at level 8"]
["Error","Table 1 (Level 1 + 2)","G58,G59,G60,G61,G62,G63,G64,G65,G66,G67","G68","W58",999,4,"EQ",0.1,"YES","NO",3,"Total ecosystems at level 1 must be equal to the sum of the subcomponents at level 2"]
{"$rows_left_out":35}
{"sheet":"xMandatory","index":13,"n_rows":24,"n_cols":9,"rows_kept":24,"cut":false,"hidden":true,"merged":[]}
["Severity","SheetName","Top Left Cell","Bottom Right Cell","Row Step","Column Step","Empty Is Valid If Footnote Exists","Footnote Shift From Value"]
["Error","GETTING STARTED","E9","E11",1,999,"NO",999]
["Error","GETTING STARTED","D15","D15",999,999,"NO",999]
["Error","GETTING STARTED","D23","D23",999,999,"NO",999]
["Warning","Table 1 (Level 1 + 2)","O10","O10",999,999,"YES",3]
[null,null,null,null,null,null,null,null,"TABEL !: ONLY LEVEL 1"]
[null,null,null,null,null,null,null,null,"TABLE 2: ALL CELLS"]
[]
[]
[]
{"$rows_left_out":15}
{"sheet":"Table 3 (Level 3)","index":14,"n_rows":140,"n_cols":8,"rows_kept":140,"cut":false,"hidden":true,"merged":[[134,2,135,2],[98,0,103,0],[104,0,112,0],[113,0,114,0],[128,1,129,1],[130,1,131,1],[130,0,139,0],[134,1,135,1],[104,1,106,1],[107,1,112,1],[115,0,117,0],[118,0,121,0],[122,0,129,0],[123,1,125,1],[126,1,127,1],[50,0,58,0],[50,1,51,1],[52,1,58,1],[7,0,24,0],[7,1,8,1],[9,1,10,1],[11,1,17,1],[18,1,20,1],[21,1,24,1],[25,0,49,0],[25,1,34,1],[36,1,43,1],[44,1,45,1],[47,1,49,1],[59,0,89,0],[59,1,68,1],[69,1,77,1],[78,1,84,1],[85,1,87,1],[90,0,97,0],[91,1,93,1],[94,1,97,1],[98,1,99,1],[100,1,102,1]]}
["Table 3 - Ecosystem extent accounts level 3 only"]
["Reporting unit = ",null,null,"1000 ha"]
["Reference year ="]
["Previous reference year = "]
["Items in bold are mandatory to be reported."]
[]
["EU ecosystem typology: level 1 ","EU ecosystem typology: level 2","EU Ecosystem typology: level 3","Opening area (Extent in the previous reference year)","Additions","Reductions","Net changes (additions less reductions; +/-)","Closing area (Extent in the current reference year)"]
["1. Settlements and other artificial areas","1.1   Continuous settlement area","1.1.1 Continuous residential area"]
[null,null,"1.1.2 Continuous commercial and industrial area"]
[null,"1.2   Discontinuous settlement area","1.2.1 Discontinuous residential area"]
{"$rows_left_out":130}